{"text_format":"1","workbook":"xlsx","n_sheets":3,"sheets":["Capacity Statement","Capacity_DB","Lists"],"not_rendered":{"charts":0,"images":0,"macros":0,"external_links":0,"defined_names":2,"comments":0,"pivot_tables":0},"unopened":[],"bounds":{"document_bytes":16777216,"sheet_cells":100000,"rows_first":2000,"rows_last":500,"rows_between":2000,"halvings":0,"cell_chars":16384,"cell_head_chars":4096},"cells_cut":0,"cells_raw":0,"read":"whole","date_system":"1900"}

{"sheet":"Capacity Statement","index":0,"n_rows":47,"n_cols":29,"rows_kept":47,"cut":false,"hidden":false,"merged":[[5,0,5,28]]}
["Selected FY","FY29/30"]
["Selected Route","General Freight: Johannesburg to Durban"]
["Capacity Factor",0.65]
["Route Spare Capacity",{"$f":"IFERROR(_xlfn.AGGREGATE(15,6,AB8:AB47/((B8:B47<>\"\")*(B8:B47<>\"N/A\")*(ISERROR(SEARCH(\"Line Closed\",C8:C47)))),1),\"\")","v":49}]
["Bottleneck Section(s)",{"$f":"IFERROR(_xlfn.TEXTJOIN(\", \",TRUE,IF((AB8:AB47=B4)*(B8:B47<>\"\")*(B8:B47<>\"N/A\")*(ISERROR(SEARCH(\"Line Closed\",C8:C47))),B8:B47,\"\")),\"\")","v":" CHAILEY (I) - DALTON (E) "}]
["NB: Hidden TOC columns can be expanded to view detailed TOC allocations."]
["Section Sequencing","Section","Depot","Theoretical Daily Capacity","Practical Daily Capacity","Train Paths Lost to TSR","Train Paths Lost to MA","Train Paths Recovered through Infrastructure Upgrades","Unused Train Paths Recovered from TOCs","Daily Available Train Paths","Weekly Practical Train Paths","TOC 1 Allocated Train Paths","TOC 2 Allocated Train Paths","TOC 3 Allocated Train Paths","TOC 4 Allocated Train Paths","TOC 5 Allocated Train Paths","TOC 6 Allocated Train Paths","TOC 7 Allocated Train Paths","TOC 8 Allocated Train Paths","TOC 9 Allocated Train Paths","TOC 10 Allocated Train Paths","TOC 11 Allocated Train Paths","TOC 12 Allocated Train Paths","TOC 13 Allocated Train Paths","TOC 14 Allocated Train Paths","TOC 15 Allocated Train Paths","Weekly Train Paths Allocated to TOCs","Weekly Spare Capacity","Constraint Indicator"]
[1,{"$f":"IFERROR(_xlfn.SINGLE(_xlfn.XLOOKUP($B$1&\"|\"&$B$2&\"|\"&A8,Capacity_DB!$A:$A,Capacity_DB!$E:$E,\"\")),\"\")","v":"CITY DEEP - JUPITER"},{"$f":"IF(OR($B8=\"\",$B8=\"N/A\"),\"\",IFERROR(_xlfn.SINGLE(_xlfn.XLOOKUP($B$1&\"|\"&$B$2&\"|\"&A8,Capacity_DB!$A:$A,Capacity_DB!$F:$F,\"\")),\"\"))","v":"VEREENIGING"},{"$f":"IF(OR($B8=\"\",$B8=\"N/A\"),\"\",IFERROR(_xlfn.SINGLE(_xlfn.XLOOKUP($B$1&\"|\"&$B$2&\"|\"&A8,Capacity_DB!$A:$A,Capacity_DB!$G:$G,\"\")),\"\"))","v":72},{"$f":"IF(OR(B8=\"\",B8=\"N/A\"),\"\",ROUND(D8*$B$3,0))","v":47},{"$f":"IF(OR($B8=\"\",$B8=\"N/A\"),\"\",IFERROR(_xlfn.SINGLE(_xlfn.XLOOKUP($B$1&\"|\"&$B$2&\"|\"&A8,Capacity_DB!$A:$A,Capacity_DB!$H:$H,0)),0))","v":0},{"$f":"IF(OR($B8=\"\",$B8=\"N/A\"),\"\",IFERROR(_xlfn.SINGLE(_xlfn.XLOOKUP($B$1&\"|\"&$B$2&\"|\"&A8,Capacity_DB!$A:$A,Capacity_DB!$I:$I,0)),0))","v":0},{"$f":"IF(OR($B8=\"\",$B8=\"N/A\"),\"\",IFERROR(_xlfn.SINGLE(_xlfn.XLOOKUP($B$1&\"|\"&$B$2&\"|\"&A8,Capacity_DB!$A:$A,Capacity_DB!$J:$J,0)),0))","v":0},{"$f":"IF(OR($B8=\"\",$B8=\"N/A\"),\"\",IFERROR(_xlfn.SINGLE(_xlfn.XLOOKUP($B$1&\"|\"&$B$2&\"|\"&A8,Capacity_DB!$A:$A,Capacity_DB!$K:$K,0)),0))","v":0},{"$f":"IF(OR(B8=\"\",B8=\"N/A\"),\"\",MAX(0,E8-F8-G8+H8+I8))","v":47},{"$f":"IF(J8=\"\",\"\",IF(ISNUMBER(SEARCH(\"Line Closed\",C8)),0,J8*7))","v":329},{"$f":"IF(OR($B8=\"\",$B8=\"N/A\"),\"\",IFERROR(_xlfn.SINGLE(_xlfn.XLOOKUP($B$1&\"|\"&$B$2&\"|\"&A8,Capacity_DB!$A:$A,Capacity_DB!$L:$L,0)),0))","v":0},{"$f":"IF(OR($B8=\"\",$B8=\"N/A\"),\"\",IFERROR(_xlfn.SINGLE(_xlfn.XLOOKUP($B$1&\"|\"&$B$2&\"|\"&A8,Capacity_DB!$A:$A,Capacity_DB!$M:$M,0)),0))","v":0},{"$f":"IF(OR($B8=\"\",$B8=\"N/A\"),\"\",IFERROR(_xlfn.SINGLE(_xlfn.XLOOKUP($B$1&\"|\"&$B$2&\"|\"&A8,Capacity_DB!$A:$A,Capacity_DB!$N:$N,0)),0))","v":0},{"$f":"IF(OR($B8=\"\",$B8=\"N/A\"),\"\",IFERROR(_xlfn.SINGLE(_xlfn.XLOOKUP($B$1&\"|\"&$B$2&\"|\"&A8,Capacity_DB!$A:$A,Capacity_DB!$O:$O,0)),0))","v":0},{"$f":"IF(OR($B8=\"\",$B8=\"N/A\"),\"\",IFERROR(_xlfn.SINGLE(_xlfn.XLOOKUP($B$1&\"|\"&$B$2&\"|\"&A8,Capacity_DB!$A:$A,Capacity_DB!$P:$P,0)),0))","v":0},{"$f":"IF(OR($B8=\"\",$B8=\"N/A\"),\"\",IFERROR(_xlfn.SINGLE(_xlfn.XLOOKUP($B$1&\"|\"&$B$2&\"|\"&A8,Capacity_DB!$A:$A,Capacity_DB!$Q:$Q,0)),0))","v":0},{"$f":"IF(OR($B8=\"\",$B8=\"N/A\"),\"\",IFERROR(_xlfn.SINGLE(_xlfn.XLOOKUP($B$1&\"|\"&$B$2&\"|\"&A8,Capacity_DB!$A:$A,Capacity_DB!$R:$R,0)),0))","v":0},{"$f":"IF(OR($B8=\"\",$B8=\"N/A\"),\"\",IFERROR(_xlfn.SINGLE(_xlfn.XLOOKUP($B$1&\"|\"&$B$2&\"|\"&A8,Capacity_DB!$A:$A,Capacity_DB!$S:$S,0)),0))","v":0},{"$f":"IF(OR($B8=\"\",$B8=\"N/A\"),\"\",IFERROR(_xlfn.SINGLE(_xlfn.XLOOKUP($B$1&\"|\"&$B$2&\"|\"&A8,Capacity_DB!$A:$A,Capacity_DB!$T:$T,0)),0))","v":0},{"$f":"IF(OR($B8=\"\",$B8=\"N/A\"),\"\",IFERROR(_xlfn.SINGLE(_xlfn.XLOOKUP($B$1&\"|\"&$B$2&\"|\"&A8,Capacity_DB!$A:$A,Capacity_DB!$U:$U,0)),0))","v":0},{"$f":"IF(OR($B8=\"\",$B8=\"N/A\"),\"\",IFERROR(_xlfn.SINGLE(_xlfn.XLOOKUP($B$1&\"|\"&$B$2&\"|\"&A8,Capacity_DB!$A:$A,Capacity_DB!$V:$V,0)),0))","v":0},{"$f":"IF(OR($B8=\"\",$B8=\"N/A\"),\"\",IFERROR(_xlfn.SINGLE(_xlfn.XLOOKUP($B$1&\"|\"&$B$2&\"|\"&A8,Capacity_DB!$A:$A,Capacity_DB!$W:$W,0)),0))","v":0},{"$f":"IF(OR($B8=\"\",$B8=\"N/A\"),\"\",IFERROR(_xlfn.SINGLE(_xlfn.XLOOKUP($B$1&\"|\"&$B$2&\"|\"&A8,Capacity_DB!$A:$A,Capacity_DB!$X:$X,0)),0))","v":0},{"$f":"IF(OR($B8=\"\",$B8=\"N/A\"),\"\",IFERROR(_xlfn.SINGLE(_xlfn.XLOOKUP($B$1&\"|\"&$B$2&\"|\"&A8,Capacity_DB!$A:$A,Capacity_DB!$Y:$Y,0)),0))","v":0},{"$f":"IF(OR($B8=\"\",$B8=\"N/A\"),\"\",IFERROR(_xlfn.SINGLE(_xlfn.XLOOKUP($B$1&\"|\"&$B$2&\"|\"&A8,Capacity_DB!$A:$A,Capacity_DB!$Z:$Z,0)),0))","v":0},{"$f":"IF(OR($B8=\"\",$B8=\"N/A\"),\"\",SUM(L8:Z8))","v":0},{"$f":"IF(K8=\"\",\"\",MAX(0,K8-AA8))","v":329},{"$f":"IF(OR(B8=\"\",B8=\"N/A\",ISNUMBER(SEARCH(\"Line Closed\",C8))),\"\",IF(AB8=$B$4,\"BOTTLENECK: \"&TEXT(AB8,\"0\"),\"\"))","v":""}]
[2,{"$f":"IFERROR(_xlfn.SINGLE(_xlfn.XLOOKUP($B$1&\"|\"&$B$2&\"|\"&A9,Capacity_DB!$A:$A,Capacity_DB!$E:$E,\"\")),\"\")","v":"KASERNE WEST - JUPITER"},{"$f":"IF(OR($B9=\"\",$B9=\"N/A\"),\"\",IFERROR(_xlfn.SINGLE(_xlfn.XLOOKUP($B$1&\"|\"&$B$2&\"|\"&A9,Capacity_DB!$A:$A,Capacity_DB!$F:$F,\"\")),\"\"))","v":"VEREENIGING"},{"$f":"IF(OR($B9=\"\",$B9=\"N/A\"),\"\",IFERROR(_xlfn.SINGLE(_xlfn.XLOOKUP($B$1&\"|\"&$B$2&\"|\"&A9,Capacity_DB!$A:$A,Capacity_DB!$G:$G,\"\")),\"\"))","v":72},{"$f":"IF(OR(B9=\"\",B9=\"N/A\"),\"\",ROUND(D9*$B$3,0))","v":47},{"$f":"IF(OR($B9=\"\",$B9=\"N/A\"),\"\",IFERROR(_xlfn.SINGLE(_xlfn.XLOOKUP($B$1&\"|\"&$B$2&\"|\"&A9,Capacity_DB!$A:$A,Capacity_DB!$H:$H,0)),0))","v":0},{"$f":"IF(OR($B9=\"\",$B9=\"N/A\"),\"\",IFERROR(_xlfn.SINGLE(_xlfn.XLOOKUP($B$1&\"|\"&$B$2&\"|\"&A9,Capacity_DB!$A:$A,Capacity_DB!$I:$I,0)),0))","v":0},{"$f":"IF(OR($B9=\"\",$B9=\"N/A\"),\"\",IFERROR(_xlfn.SINGLE(_xlfn.XLOOKUP($B$1&\"|\"&$B$2&\"|\"&A9,Capacity_DB!$A:$A,Capacity_DB!$J:$J,0)),0))","v":0},{"$f":"IF(OR($B9=\"\",$B9=\"N/A\"),\"\",IFERROR(_xlfn.SINGLE(_xlfn.XLOOKUP($B$1&\"|\"&$B$2&\"|\"&A9,Capacity_DB!$A:$A,Capacity_DB!$K:$K,0)),0))","v":0},47,{"$f":"IF(J9=\"\",\"\",IF(ISNUMBER(SEARCH(\"Line Closed\",C9)),0,J9*7))","v":329},{"$f":"IF(OR($B9=\"\",$B9=\"N/A\"),\"\",IFERROR(_xlfn.SINGLE(_xlfn.XLOOKUP($B$1&\"|\"&$B$2&\"|\"&A9,Capacity_DB!$A:$A,Capacity_DB!$L:$L,0)),0))","v":0},{"$f":"IF(OR($B9=\"\",$B9=\"N/A\"),\"\",IFERROR(_xlfn.SINGLE(_xlfn.XLOOKUP($B$1&\"|\"&$B$2&\"|\"&A9,Capacity_DB!$A:$A,Capacity_DB!$M:$M,0)),0))","v":0},{"$f":"IF(OR($B9=\"\",$B9=\"N/A\"),\"\",IFERROR(_xlfn.SINGLE(_xlfn.XLOOKUP($B$1&\"|\"&$B$2&\"|\"&A9,Capacity_DB!$A:$A,Capacity_DB!$N:$N,0)),0))","v":0},{"$f":"IF(OR($B9=\"\",$B9=\"N/A\"),\"\",IFERROR(_xlfn.SINGLE(_xlfn.XLOOKUP($B$1&\"|\"&$B$2&\"|\"&A9,Capacity_DB!$A:$A,Capacity_DB!$O:$O,0)),0))","v":0},{"$f":"IF(OR($B9=\"\",$B9=\"N/A\"),\"\",IFERROR(_xlfn.SINGLE(_xlfn.XLOOKUP($B$1&\"|\"&$B$2&\"|\"&A9,Capacity_DB!$A:$A,Capacity_DB!$P:$P,0)),0))","v":0},{"$f":"IF(OR($B9=\"\",$B9=\"N/A\"),\"\",IFERROR(_xlfn.SINGLE(_xlfn.XLOOKUP($B$1&\"|\"&$B$2&\"|\"&A9,Capacity_DB!$A:$A,Capacity_DB!$Q:$Q,0)),0))","v":0},{"$f":"IF(OR($B9=\"\",$B9=\"N/A\"),\"\",IFERROR(_xlfn.SINGLE(_xlfn.XLOOKUP($B$1&\"|\"&$B$2&\"|\"&A9,Capacity_DB!$A:$A,Capacity_DB!$R:$R,0)),0))","v":0},{"$f":"IF(OR($B9=\"\",$B9=\"N/A\"),\"\",IFERROR(_xlfn.SINGLE(_xlfn.XLOOKUP($B$1&\"|\"&$B$2&\"|\"&A9,Capacity_DB!$A:$A,Capacity_DB!$S:$S,0)),0))","v":0},{"$f":"IF(OR($B9=\"\",$B9=\"N/A\"),\"\",IFERROR(_xlfn.SINGLE(_xlfn.XLOOKUP($B$1&\"|\"&$B$2&\"|\"&A9,Capacity_DB!$A:$A,Capacity_DB!$T:$T,0)),0))","v":0},{"$f":"IF(OR($B9=\"\",$B9=\"N/A\"),\"\",IFERROR(_xlfn.SINGLE(_xlfn.XLOOKUP($B$1&\"|\"&$B$2&\"|\"&A9,Capacity_DB!$A:$A,Capacity_DB!$U:$U,0)),0))","v":0},{"$f":"IF(OR($B9=\"\",$B9=\"N/A\"),\"\",IFERROR(_xlfn.SINGLE(_xlfn.XLOOKUP($B$1&\"|\"&$B$2&\"|\"&A9,Capacity_DB!$A:$A,Capacity_DB!$V:$V,0)),0))","v":0},{"$f":"IF(OR($B9=\"\",$B9=\"N/A\"),\"\",IFERROR(_xlfn.SINGLE(_xlfn.XLOOKUP($B$1&\"|\"&$B$2&\"|\"&A9,Capacity_DB!$A:$A,Capacity_DB!$W:$W,0)),0))","v":0},{"$f":"IF(OR($B9=\"\",$B9=\"N/A\"),\"\",IFERROR(_xlfn.SINGLE(_xlfn.XLOOKUP($B$1&\"|\"&$B$2&\"|\"&A9,Capacity_DB!$A:$A,Capacity_DB!$X:$X,0)),0))","v":0},{"$f":"IF(OR($B9=\"\",$B9=\"N/A\"),\"\",IFERROR(_xlfn.SINGLE(_xlfn.XLOOKUP($B$1&\"|\"&$B$2&\"|\"&A9,Capacity_DB!$A:$A,Capacity_DB!$Y:$Y,0)),0))","v":0},{"$f":"IF(OR($B9=\"\",$B9=\"N/A\"),\"\",IFERROR(_xlfn.SINGLE(_xlfn.XLOOKUP($B$1&\"|\"&$B$2&\"|\"&A9,Capacity_DB!$A:$A,Capacity_DB!$Z:$Z,0)),0))","v":0},0,{"$f":"IF(K9=\"\",\"\",MAX(0,K9-AA9))","v":329},{"$f":"IF(OR(B9=\"\",B9=\"N/A\",ISNUMBER(SEARCH(\"Line Closed\",C9))),\"\",IF(AB9=$B$4,\"BOTTLENECK: \"&TEXT(AB9,\"0\"),\"\"))","v":""}]
[3,{"$f":"IFERROR(_xlfn.SINGLE(_xlfn.XLOOKUP($B$1&\"|\"&$B$2&\"|\"&A10,Capacity_DB!$A:$A,Capacity_DB!$E:$E,\"\")),\"\")","v":"JUPITER - INDIA"},{"$f":"IF(OR($B10=\"\",$B10=\"N/A\"),\"\",IFERROR(_xlfn.SINGLE(_xlfn.XLOOKUP($B$1&\"|\"&$B$2&\"|\"&A10,Capacity_DB!$A:$A,Capacity_DB!$F:$F,\"\")),\"\"))","v":"VEREENIGING"},{"$f":"IF(OR($B10=\"\",$B10=\"N/A\"),\"\",IFERROR(_xlfn.SINGLE(_xlfn.XLOOKUP($B$1&\"|\"&$B$2&\"|\"&A10,Capacity_DB!$A:$A,Capacity_DB!$G:$G,\"\")),\"\"))","v":72},47,{"$f":"IF(OR($B10=\"\",$B10=\"N/A\"),\"\",IFERROR(_xlfn.SINGLE(_xlfn.XLOOKUP($B$1&\"|\"&$B$2&\"|\"&A10,Capacity_DB!$A:$A,Capacity_DB!$H:$H,0)),0))","v":0},{"$f":"IF(OR($B10=\"\",$B10=\"N/A\"),\"\",IFERROR(_xlfn.SINGLE(_xlfn.XLOOKUP($B$1&\"|\"&$B$2&\"|\"&A10,Capacity_DB!$A:$A,Capacity_DB!$I:$I,0)),0))","v":0},{"$f":"IF(OR($B10=\"\",$B10=\"N/A\"),\"\",IFERROR(_xlfn.SINGLE(_xlfn.XLOOKUP($B$1&\"|\"&$B$2&\"|\"&A10,Capacity_DB!$A:$A,Capacity_DB!$J:$J,0)),0))","v":0},{"$f":"IF(OR($B10=\"\",$B10=\"N/A\"),\"\",IFERROR(_xlfn.SINGLE(_xlfn.XLOOKUP($B$1&\"|\"&$B$2&\"|\"&A10,Capacity_DB!$A:$A,Capacity_DB!$K:$K,0)),0))","v":0},47,329,{"$f":"IF(OR($B10=\"\",$B10=\"N/A\"),\"\",IFERROR(_xlfn.SINGLE(_xlfn.XLOOKUP($B$1&\"|\"&$B$2&\"|\"&A10,Capacity_DB!$A:$A,Capacity_DB!$L:$L,0)),0))","v":0},{"$f":"IF(OR($B10=\"\",$B10=\"N/A\"),\"\",IFERROR(_xlfn.SINGLE(_xlfn.XLOOKUP($B$1&\"|\"&$B$2&\"|\"&A10,Capacity_DB!$A:$A,Capacity_DB!$M:$M,0)),0))","v":0},{"$f":"IF(OR($B10=\"\",$B10=\"N/A\"),\"\",IFERROR(_xlfn.SINGLE(_xlfn.XLOOKUP($B$1&\"|\"&$B$2&\"|\"&A10,Capacity_DB!$A:$A,Capacity_DB!$N:$N,0)),0))","v":0},{"$f":"IF(OR($B10=\"\",$B10=\"N/A\"),\"\",IFERROR(_xlfn.SINGLE(_xlfn.XLOOKUP($B$1&\"|\"&$B$2&\"|\"&A10,Capacity_DB!$A:$A,Capacity_DB!$O:$O,0)),0))","v":0},{"$f":"IF(OR($B10=\"\",$B10=\"N/A\"),\"\",IFERROR(_xlfn.SINGLE(_xlfn.XLOOKUP($B$1&\"|\"&$B$2&\"|\"&A10,Capacity_DB!$A:$A,Capacity_DB!$P:$P,0)),0))","v":0},{"$f":"IF(OR($B10=\"\",$B10=\"N/A\"),\"\",IFERROR(_xlfn.SINGLE(_xlfn.XLOOKUP($B$1&\"|\"&$B$2&\"|\"&A10,Capacity_DB!$A:$A,Capacity_DB!$Q:$Q,0)),0))","v":0},{"$f":"IF(OR($B10=\"\",$B10=\"N/A\"),\"\",IFERROR(_xlfn.SINGLE(_xlfn.XLOOKUP($B$1&\"|\"&$B$2&\"|\"&A10,Capacity_DB!$A:$A,Capacity_DB!$R:$R,0)),0))","v":0},{"$f":"IF(OR($B10=\"\",$B10=\"N/A\"),\"\",IFERROR(_xlfn.SINGLE(_xlfn.XLOOKUP($B$1&\"|\"&$B$2&\"|\"&A10,Capacity_DB!$A:$A,Capacity_DB!$S:$S,0)),0))","v":0},{"$f":"IF(OR($B10=\"\",$B10=\"N/A\"),\"\",IFERROR(_xlfn.SINGLE(_xlfn.XLOOKUP($B$1&\"|\"&$B$2&\"|\"&A10,Capacity_DB!$A:$A,Capacity_DB!$T:$T,0)),0))","v":0},{"$f":"IF(OR($B10=\"\",$B10=\"N/A\"),\"\",IFERROR(_xlfn.SINGLE(_xlfn.XLOOKUP($B$1&\"|\"&$B$2&\"|\"&A10,Capacity_DB!$A:$A,Capacity_DB!$U:$U,0)),0))","v":0},{"$f":"IF(OR($B10=\"\",$B10=\"N/A\"),\"\",IFERROR(_xlfn.SINGLE(_xlfn.XLOOKUP($B$1&\"|\"&$B$2&\"|\"&A10,Capacity_DB!$A:$A,Capacity_DB!$V:$V,0)),0))","v":0},{"$f":"IF(OR($B10=\"\",$B10=\"N/A\"),\"\",IFERROR(_xlfn.SINGLE(_xlfn.XLOOKUP($B$1&\"|\"&$B$2&\"|\"&A10,Capacity_DB!$A:$A,Capacity_DB!$W:$W,0)),0))","v":0},{"$f":"IF(OR($B10=\"\",$B10=\"N/A\"),\"\",IFERROR(_xlfn.SINGLE(_xlfn.XLOOKUP($B$1&\"|\"&$B$2&\"|\"&A10,Capacity_DB!$A:$A,Capacity_DB!$X:$X,0)),0))","v":0},{"$f":"IF(OR($B10=\"\",$B10=\"N/A\"),\"\",IFERROR(_xlfn.SINGLE(_xlfn.XLOOKUP($B$1&\"|\"&$B$2&\"|\"&A10,Capacity_DB!$A:$A,Capacity_DB!$Y:$Y,0)),0))","v":0},{"$f":"IF(OR($B10=\"\",$B10=\"N/A\"),\"\",IFERROR(_xlfn.SINGLE(_xlfn.XLOOKUP($B$1&\"|\"&$B$2&\"|\"&A10,Capacity_DB!$A:$A,Capacity_DB!$Z:$Z,0)),0))","v":0},0,329,""]
{"$rows_left_out":38}
{"sheet":"Capacity_DB","index":1,"n_rows":1416,"n_cols":26,"rows_kept":1416,"cut":false,"hidden":true,"merged":[]}
["Key","Year","Route","Section Order","Section","Depot","Theoretical Daily Capacity","Train Paths Lost to TSR","Train Paths Lost to MA","Train Paths Infra Recovery","Train Paths Unused & Recovered from TOCs","TOC 1 Allocated Train Paths","TOC 2 Allocated Train Paths","TOC 3 Allocated Train Paths","TOC 4 Allocated Train Paths","TOC 5 Allocated Train Paths","TOC 6 Allocated Train Paths","TOC 7 Allocated Train Paths","TOC 8 Allocated Train Paths","TOC 9 Allocated Train Paths","TOC 10 Allocated Train Paths","TOC 11 Allocated Train Paths","TOC 12 Allocated Train Paths","TOC 13 Allocated Train Paths","TOC 14 Allocated Train Paths","TOC 15 Allocated Train Paths"]
["FY26/27|Eastern Mainline: Rayton to Komatipoort/Richards Bay|1","FY26/27","Eastern Mainline: Rayton to Komatipoort/Richards Bay",1,"RAYTON (I) - WITBANK (E)","WITBANK",19,0,8,0,0,8,0,0,1,4,0,0,0,0,0,0,0,0,0,0]
["FY26/27|Eastern Mainline: Rayton to Komatipoort/Richards Bay|2","FY26/27","Eastern Mainline: Rayton to Komatipoort/Richards Bay",2,"WITBANK (I) - DERWENT (I)","WITBANK",33,1,14,0,0,19,1,0,3,0,0,0,0,0,0,0,0,0,0,0]
["FY26/27|Eastern Mainline: Rayton to Komatipoort/Richards Bay|3","FY26/27","Eastern Mainline: Rayton to Komatipoort/Richards Bay",3,"DERWENT (E) - BELFAST (I)","WITBANK",30,0,14,0,0,27,1,0,5,2,1,0,0,1,0,0,0,0,0,0]
["FY26/27|Eastern Mainline: Rayton to Komatipoort/Richards Bay|4","FY26/27","Eastern Mainline: Rayton to Komatipoort/Richards Bay",4,"STEELPOORT (I) - BELFAST (E)","WITBANK",18,0,5,0,0,13,0,0,0,0,0,0,0,0,0,0,0,0,0,0]
["FY26/27|Eastern Mainline: Rayton to Komatipoort/Richards Bay|5","FY26/27","Eastern Mainline: Rayton to Komatipoort/Richards Bay",5,"BELFAST (E) - GOEDGELUK (I)","WITBANK",13,0,3,0,0,34,1,0,5,2,0,0,1,1,0,0,0,0,0,0]
["FY26/27|Eastern Mainline: Rayton to Komatipoort/Richards Bay|6","FY26/27","Eastern Mainline: Rayton to Komatipoort/Richards Bay",6,"GOEDGELUK (E) - NELSPRUIT (E)","NELSPRUIT",30,1,13,0,0,37,1,0,5,2,0,0,1,1,0,0,0,0,0,0]
["FY26/27|Eastern Mainline: Rayton to Komatipoort/Richards Bay|7","FY26/27","Eastern Mainline: Rayton to Komatipoort/Richards Bay",7,"NELSPRUIT (I) - KAAPMUIDEN (I)","NELSPRUIT",36,1,14,0,0,35,1,0,5,2,0,0,1,1,0,0,0,0,0,0]
["FY26/27|Eastern Mainline: Rayton to Komatipoort/Richards Bay|8","FY26/27","Eastern Mainline: Rayton to Komatipoort/Richards Bay",8,"KAAPMUIDEN (E) - BARBERTON (I)","NELSPRUIT (Line Closed)",15,0,0,0,0,0,0,0,0,0,0,0,0,0,0,0,0,0,0,0]
["FY26/27|Eastern Mainline: Rayton to Komatipoort/Richards Bay|9","FY26/27","Eastern Mainline: Rayton to Komatipoort/Richards Bay",9,"KAAPMUIDEN (E) - KOMATIPOORT (I)","NELSPRUIT",54,0,2,0,0,80,1,0,11,2,1,3,1,1,0,0,0,0,0,0]
{"$rows_left_out":1407}
{"sheet":"Lists","index":2,"n_rows":11,"n_cols":2,"rows_kept":11,"cut":false,"hidden":true,"merged":[]}
["Financial Years","Routes"]
["FY26/27","General Freight: Johannesburg to Durban"]
["FY27/28","General Freight: Johannesburg to Cape Town"]
["FY28/29","Manganese"]
["FY29/30","Magnetite"]
["FY30/31","General Freight & Export Coal: Lephalale to Richards Bay"]
[null,"General Freight: Musina - Pyramid South/Hoedspruit"]
[null,"Eastern Mainline: Rayton to Komatipoort/Richards Bay"]
[null,"General Freight: Mafikeng to Beaconsfield/Potchefstroom"]
[null,"General Freight: Vereeniging/Danskraal to East London"]
{"$rows_left_out":1}